Reaction Details
TargetCytochrome P450 1A2
LigandBDBM50078748
Substrate/Competitorn/a
Meas. Tech.ChEMBL_1471629 (CHEMBL3420788)
IC50>50000±n/a nM
Citation Lin, XChen, WQiu, ZGuo, LZhu, WLi, WWang, ZZhang, WZhang, ZRong, YZhang, MYu, LZhong, SZhao, RWu, XWong, JCTang, G Design and synthesis of orally bioavailable aminopyrrolidinone histone deacetylase 6 inhibitors. J Med Chem58:2809-20 (2015) 
 
Cytochrome P450 1A2
Name:Cytochrome P450 1A2
Type:Enzyme
Mol. Mass.:58423.38
Organism:Homo sapiens (Human)
Description:P05177
Residue:516
BDBM50078748
NameBDBM50078748
Synonyms:CHEMBL3415629
TypeSmall organic molecule
Emp. Form.C18H18ClN3O3
Mol. Mass.359.807
SMILESC[C@@]1(CCN(C1=O)c1ccc(Cl)cc1)Nc1ccc(cc1)C(=O)NO