Reaction Details
TargetHistone acetyltransferase p300
LigandBDBM50081125
Substrate/Competitorn/a
Meas. Tech.ChEMBL_1475676 (CHEMBL3424835)
Ki 2000±n/a nM
Citation Milite, CFeoli, ASasaki, KLa Pietra, VBalzano, ALMarinelli, LMai, ANovellino, ECastellano, STosco, ASbardella, G A novel cell-permeable, selective, and noncompetitive inhibitor of KAT3 histone acetyltransferases from a combined molecular pruning/classical isosterism approach. J Med Chem58:2779-98 (2015) 
 
Histone acetyltransferase p300
Name:Histone acetyltransferase p300
Type:Protein
Mol. Mass.:264223.04
Organism:Homo sapiens (Human)
Description:Q09472
Residue:2414
BDBM50081125
NameBDBM50081125
Synonyms:CHEMBL3421961
TypeSmall organic molecule
Emp. Form.C27H24N2O4
Mol. Mass.440.4905
SMILES[#6]-c1cc(-[#8])cc(-[#6])c1\[#6]=[#6]-1/[#6](=O)-[#7](-[#6]-c2ccccc2)-[#6](=O)-[#7](-[#6]-c2ccccc2)-[#6]-1=O