Reaction Details
TargetHistone acetyltransferase p300
LigandBDBM50081163
Substrate/Competitorn/a
Meas. Tech.ChEMBL_1475663 (CHEMBL3424792)
IC50 11400±n/a nM
Citation Milite, CFeoli, ASasaki, KLa Pietra, VBalzano, ALMarinelli, LMai, ANovellino, ECastellano, STosco, ASbardella, G A novel cell-permeable, selective, and noncompetitive inhibitor of KAT3 histone acetyltransferases from a combined molecular pruning/classical isosterism approach. J Med Chem58:2779-98 (2015) 
 
Histone acetyltransferase p300
Name:Histone acetyltransferase p300
Type:Protein
Mol. Mass.:264223.04
Organism:Homo sapiens (Human)
Description:Q09472
Residue:2414
BDBM50081163
NameBDBM50081163
Synonyms:CHEMBL3421944
TypeSmall organic molecule
Emp. Form.C27H24N2O5
Mol. Mass.456.4899
SMILES[#6]-[#8]-c1ccc(\[#6]=[#6]-2\[#6](=O)-[#7](-[#6]-c3ccccc3)-[#6](=O)-[#7](-[#6]-c3ccccc3)-[#6]-2=O)cc1-[#8]-[#6]