Reaction Details
TargetHistone acetyltransferase p300
LigandBDBM50081166
Substrate/Competitorn/a
Meas. Tech.ChEMBL_1475663 (CHEMBL3424792)
IC50 5400±n/a nM
Citation Milite, CFeoli, ASasaki, KLa Pietra, VBalzano, ALMarinelli, LMai, ANovellino, ECastellano, STosco, ASbardella, G A novel cell-permeable, selective, and noncompetitive inhibitor of KAT3 histone acetyltransferases from a combined molecular pruning/classical isosterism approach. J Med Chem58:2779-98 (2015) 
 
Histone acetyltransferase p300
Name:Histone acetyltransferase p300
Type:Protein
Mol. Mass.:264223.04
Organism:Homo sapiens (Human)
Description:Q09472
Residue:2414
BDBM50081166
NameBDBM50081166
Synonyms:CHEMBL3421948
TypeSmall organic molecule
Emp. Form.C19H24N2O5
Mol. Mass.360.4043
SMILES[#6]-[#6](-[#6])-[#6]-[#7]-1-[#6](=O)-[#7](-[#6]-[#6](-[#6])-[#6])-[#6](=O)\[#6](=[#6]/c2ccc(-[#8])c(-[#8])c2)-[#6]-1=O