Reaction Details
TargetHistone acetyltransferase p300
LigandBDBM50081169
Substrate/Competitorn/a
Meas. Tech.ChEMBL_1475663 (CHEMBL3424792)
IC50 26400±n/a nM
Citation Milite, CFeoli, ASasaki, KLa Pietra, VBalzano, ALMarinelli, LMai, ANovellino, ECastellano, STosco, ASbardella, G A novel cell-permeable, selective, and noncompetitive inhibitor of KAT3 histone acetyltransferases from a combined molecular pruning/classical isosterism approach. J Med Chem58:2779-98 (2015) 
 
Histone acetyltransferase p300
Name:Histone acetyltransferase p300
Type:Protein
Mol. Mass.:264223.04
Organism:Homo sapiens (Human)
Description:Q09472
Residue:2414
BDBM50081169
NameBDBM50081169
Synonyms:CHEMBL3421957
TypeSmall organic molecule
Emp. Form.C18H18N2O5
Mol. Mass.342.3459
SMILES[#6]-[#8]-c1cc(\[#6]=[#6]-2/[#6](=O)-[#7](-[#6]-[#6]=[#6])-[#6](=O)-[#7](-[#6]-[#6]=[#6])-[#6]-2=O)ccc1-[#8]