Reaction Details
TargetDual specificity protein kinase TTK
LigandBDBM50081173
Substrate/Competitorn/a
Meas. Tech.ChEMBL_1475758 (CHEMBL3424991)
IC50 20±n/a nM
Citation Kettle, JGBallard, PBardelle, CCockerill, MColclough, NCritchlow, SEDebreczeni, JFairley, GFillery, SGraham, MAGoodwin, LGuichard, SHudson, KWard, RAWhittaker, D Discovery and optimization of a novel series of Dyrk1B kinase inhibitors to explore a MEK resistance hypothesis. J Med Chem58:2834-44 (2015) 
 
Dual specificity protein kinase TTK
Name:Dual specificity protein kinase TTK
Type:Protein
Mol. Mass.:97086.79
Organism:Homo sapiens (Human)
Description:P33981
Residue:857
BDBM50081173
NameBDBM50081173
Synonyms:CHEMBL3421972
TypeSmall organic molecule
Emp. Form.C24H26N6O2
Mol. Mass.430.5022
SMILESCOc1cc(OC2CCN(C)CC2)ccc1Nc1nccc(n1)-c1c[nH]c2cnccc12