Reaction Details
TargetDual specificity tyrosine-phosphorylation-regulated kinase 1B
LigandBDBM50081177
Substrate/Competitorn/a
Meas. Tech.ChEMBL_1475745 (CHEMBL3424978)
IC50 25±n/a nM
Citation Kettle, JGBallard, PBardelle, CCockerill, MColclough, NCritchlow, SEDebreczeni, JFairley, GFillery, SGraham, MAGoodwin, LGuichard, SHudson, KWard, RAWhittaker, D Discovery and optimization of a novel series of Dyrk1B kinase inhibitors to explore a MEK resistance hypothesis. J Med Chem58:2834-44 (2015) 
 
Dual specificity tyrosine-phosphorylation-regulated kinase 1B
Name:Dual specificity tyrosine-phosphorylation-regulated kinase 1B
Type:Enzyme
Mol. Mass.:69222.24
Organism:Homo sapiens (Human)
Description:Q9Y463
Residue:629
BDBM50081177
NameBDBM50081177
Synonyms:CHEMBL3421973
TypeSmall organic molecule
Emp. Form.C22H22ClN7
Mol. Mass.419.91
SMILESCN1CCN(CC1)c1ccc(Nc2ncc(Cl)c(n2)-c2c[nH]c3cnccc23)cc1