Reaction Details
TargetDual specificity tyrosine-phosphorylation-regulated kinase 1B
LigandBDBM100152
Substrate/Competitorn/a
Meas. Tech.ChEMBL_1475742 (CHEMBL3424944)
IC50 166±n/a nM
Citation Kettle, JGBallard, PBardelle, CCockerill, MColclough, NCritchlow, SEDebreczeni, JFairley, GFillery, SGraham, MAGoodwin, LGuichard, SHudson, KWard, RAWhittaker, D Discovery and optimization of a novel series of Dyrk1B kinase inhibitors to explore a MEK resistance hypothesis. J Med Chem58:2834-44 (2015) 
 
Dual specificity tyrosine-phosphorylation-regulated kinase 1B
Name:Dual specificity tyrosine-phosphorylation-regulated kinase 1B
Type:Enzyme
Mol. Mass.:69222.24
Organism:Homo sapiens (Human)
Description:Q9Y463
Residue:629
BDBM100152
NameBDBM100152
Synonyms:7-methoxy-1-methyl-9H-beta-carboline;hydrochloride HARMINE MLS002153910 cid_5359389
TypeSmall organic molecule
Emp. Form.C13H12N2O
Mol. Mass.212.2472
SMILESCOc1ccc2c(c1)[nH]c1c(C)nccc21