Reaction Details
TargetDual specificity tyrosine-phosphorylation-regulated kinase 1A
LigandBDBM100152
Substrate/Competitorn/a
Meas. Tech.ChEMBL_1475741 (CHEMBL3424943)
IC50 33±n/a nM
Citation Kettle, JGBallard, PBardelle, CCockerill, MColclough, NCritchlow, SEDebreczeni, JFairley, GFillery, SGraham, MAGoodwin, LGuichard, SHudson, KWard, RAWhittaker, D Discovery and optimization of a novel series of Dyrk1B kinase inhibitors to explore a MEK resistance hypothesis. J Med Chem58:2834-44 (2015) 
 
Dual specificity tyrosine-phosphorylation-regulated kinase 1A
Name:Dual specificity tyrosine-phosphorylation-regulated kinase 1A
Type:Enzyme
Mol. Mass.:85616.61
Organism:Homo sapiens (Human)
Description:Q13627
Residue:763
BDBM100152
NameBDBM100152
Synonyms:7-methoxy-1-methyl-9H-beta-carboline;hydrochloride HARMINE MLS002153910 cid_5359389
TypeSmall organic molecule
Emp. Form.C13H12N2O
Mol. Mass.212.2472
SMILESCOc1ccc2c(c1)[nH]c1c(C)nccc21