Reaction Details
TargetCyclin-dependent kinase 2
LigandBDBM50081180
Substrate/Competitorn/a
Meas. Tech.ChEMBL_1475748 (CHEMBL3424981)
IC50 10476±n/a nM
Citation Kettle, JGBallard, PBardelle, CCockerill, MColclough, NCritchlow, SEDebreczeni, JFairley, GFillery, SGraham, MAGoodwin, LGuichard, SHudson, KWard, RAWhittaker, D Discovery and optimization of a novel series of Dyrk1B kinase inhibitors to explore a MEK resistance hypothesis. J Med Chem58:2834-44 (2015) 
 
Cyclin-dependent kinase 2
Name:Cyclin-dependent kinase 2
Type:Enzyme Subunit
Mol. Mass.:33938.17
Organism:Homo sapiens (Human)
Description:P24941
Residue:298
BDBM50081180
NameBDBM50081180
Synonyms:CHEMBL3421969
TypeSmall organic molecule
Emp. Form.C24H27N7O
Mol. Mass.429.5175
SMILESCOc1cc(ccc1Nc1nccc(n1)-c1c[nH]c2cnc(C)cc12)N1CCN(C)CC1