Reaction Details
TargetADP-ribosyl cyclase/cyclic ADP-ribose hydrolase 1
LigandBDBM50086412
Substrate/Competitorn/a
Meas. Tech.ChEMBL_1476004 (CHEMBL3428360)
IC50 17±n/a nM
Citation Haffner, CDBecherer, JDBoros, EECadilla, RCarpenter, TCowan, DDeaton, DNGuo, YHarrington, WHenke, BRJeune, MRKaldor, IMilliken, NPetrov, KGPreugschat, FSchulte, CShearer, BGShearer, TSmalley, TLStewart, ELStuart, JDUlrich, JC Discovery, Synthesis, and Biological Evaluation of Thiazoloquin(az)olin(on)es as Potent CD38 Inhibitors. J Med Chem58:3548-71 (2015) 
 
ADP-ribosyl cyclase/cyclic ADP-ribose hydrolase 1
Name:ADP-ribosyl cyclase/cyclic ADP-ribose hydrolase 1
Type:PROTEIN
Mol. Mass.:34417.04
Organism:Mus musculus
Description:ChEMBL_109609
Residue:304
BDBM50086412
NameBDBM50086412
Synonyms:CHEMBL3426078
TypeSmall organic molecule
Emp. Form.C18H14N4S
Mol. Mass.318.396
SMILESCc1cccc(Nc2ncnc3ccc(cc23)-c2cncs2)c1