Reaction Details
TargetMitogen-activated protein kinase 1
LigandBDBM50086441
Substrate/Competitorn/a
Meas. Tech.ChEMBL_1476374 (CHEMBL3430004)
IC50>10000±n/a nM
Citation Zhang, CHZheng, MWLi, YPLin, XDHuang, MZhong, LLi, GBZhang, RJLin, WTJiao, YWu, XAYang, JXiang, RChen, LJZhao, YLCheng, WWei, YQYang, SY Design, Synthesis, and Structure-Activity Relationship Studies of 3-(Phenylethynyl)-1H-pyrazolo[3,4-d]pyrimidin-4-amine Derivatives as a New Class of Src Inhibitors with Potent Activities in Models of Triple Negative Breast Cancer. J Med Chem58:3957-74 (2015) 
 
Mitogen-activated protein kinase 1
Name:Mitogen-activated protein kinase 1
Type:Ser/Thr Protein Kinase
Mol. Mass.:41392.76
Organism:Homo sapiens (Human)
Description:P28482
Residue:360
BDBM50086441
NameBDBM50086441
Synonyms:CHEMBL3426225 | US10266537, Compound 3
TypeSmall organic molecule
Emp. Form.C30H31F3N8O
Mol. Mass.576.6153
SMILESCCn1nc(C#Cc2cc(ccc2C)C(=O)Nc2ccc(CN3CCN(C)CC3)c(c2)C(F)(F)F)c2c(N)ncnc12