Reaction Details
TargetHistone deacetylase 2
LigandBDBM19149
Substrate/Competitorn/a
Meas. Tech.ChEMBL_1495532 (CHEMBL3580078)
IC50 174±n/a nM
Citation He, SDong, GWang, ZChen, WHuang, YLi, ZJiang, YLiu, NYao, JMiao, ZZhang, WSheng, C Discovery of Novel Multiacting Topoisomerase I/II and Histone Deacetylase Inhibitors. ACS Med Chem Lett6:239-43 (2015) 
 
Histone deacetylase 2
Name:Histone deacetylase 2
Type:Chromatin regulator; hydrolase; repressor
Mol. Mass.:55356.54
Organism:Homo sapiens (Human)
Description:Q92769
Residue:488
BDBM19149
NameBDBM19149
Synonyms:CHEMBL98 SAHA US10188756, Compound SAHA US11505523, Compound SAHA US9353061, SAHA US9695181, Vorinostat Zolinza suberoylanilide hydroxamic acid
TypeSmall organic molecule
Emp. Form.C14H20N2O3
Mol. Mass.264.3202
SMILESONC(=O)CCCCCCC(=O)Nc1ccccc1