Reaction Details
TargetHistamine H3 receptor
LigandBDBM50089369
Substrate/Competitorn/a
Meas. Tech.ChEMBL_1496464 (CHEMBL3578410)
Ki 0.700000±n/a nM
Citation Letavic, MAAluisio, LApodaca, RBajpai, MBarbier, AJBonneville, ABonaventure, PCarruthers, NIDugovic, CFraser, ICKramer, MLLord, BLovenberg, TWLi, LYLy, KSMcallister, HMani, NSMorton, KLNdifor, ANepomuceno, SDPandit, CRSands, SBShah, CRShelton, JESnook, SSSwanson, DMXiao, W Novel benzamide-based histamine h3 receptor antagonists: the identification of two candidates for clinical development. ACS Med Chem Lett6:450-4 (2015) 
 
Histamine H3 receptor
Name:Histamine H3 receptor
Type:G Protein-Coupled Receptor (GPCR)
Mol. Mass.:48691.47
Organism:Homo sapiens (Human)
Description:Binding assays were using CHO cells stably expressing hH3R receptors.
Residue:445
BDBM50089369
NameBDBM50089369
Synonyms:CHEMBL3577959
TypeSmall organic molecule
Emp. Form.C21H30FN3O
Mol. Mass.359.4808
SMILESFC1CCN(Cc2ccc(cc2)C(=O)N2CCN(CC2)C2CCC2)CC1