Reaction Details
TargetMineralocorticoid receptor
LigandBDBM50089636
Substrate/Competitorn/a
Meas. Tech.ChEMBL_1497367 (CHEMBL3579316)
Ki 2.0±n/a nM
Citation Yang, CBalsells, JChu, HDCox, JMCrespo, AMa, XContino, LBrown, PGao, SZamlynny, BWiltsie, JClemas, JLisnock, JGibson, JZhou, GGarcia-Calvo, MBateman, TJTong, VXu, LCrook, MSinclair, PShen, HC Discovery of benzimidazole oxazolidinediones as novel and selective nonsteroidal mineralocorticoid receptor antagonists. ACS Med Chem Lett6:461-5 (2015) 
 
Mineralocorticoid receptor
Name:Mineralocorticoid receptor
Type:Enzyme
Mol. Mass.:107076.42
Organism:Homo sapiens (Human)
Description:P08235
Residue:984
BDBM50089636
NameBDBM50089636
Synonyms:CHEMBL3578271
TypeSmall organic molecule
Emp. Form.C25H19ClFN3O3
Mol. Mass.463.888
SMILESC[C@@H](N1C(=O)O[C@@](Cc2ccccc2)(C1=O)c1nc2cc(Cl)ccc2[nH]1)c1ccc(F)cc1