Reaction Details
TargetL-lactate dehydrogenase A chain
LigandBDBM50052254
Substrate/Competitorn/a
Meas. Tech.ChEMBL_1499429 (CHEMBL3583864)
IC50 870±n/a nM
Citation Labadie, SDragovich, PSChen, JFauber, BPBoggs, JCorson, LBDing, CZEigenbrot, CGe, HHo, QLai, KWMa, SMalek, SPeterson, DPurkey, HERobarge, KSalphati, LSideris, SUltsch, MVanderPorten, EWei, BXu, QYen, IYue, QZhang, HZhang, XZhou, A Optimization of 5-(2,6-dichlorophenyl)-3-hydroxy-2-mercaptocyclohex-2-enones as potent inhibitors of human lactate dehydrogenase. Bioorg Med Chem Lett25:75-82 (2015) 
 
L-lactate dehydrogenase A chain
Name:L-lactate dehydrogenase A chain
Type:Protein
Mol. Mass.:36694.85
Organism:Homo sapiens (Human)
Description:P00338::PDB Code: 4ajp
Residue:332
BDBM50052254
NameBDBM50052254
Synonyms:2',6'-dichloro-4-((2-chlorophenyl)thio)-5-hydroxy-1,6-dihydro-[1,1'-biphenyl]-3(2H)-one (3) | CHEMBL3318469
TypeSmall organic molecule
Emp. Form.C18H13Cl3O2S
Mol. Mass.399.719
SMILESOC1=C(Sc2ccccc2Cl)C(=O)CC(C1)c1c(Cl)cccc1Cl