Reaction Details
TargetL-lactate dehydrogenase A chain
LigandBDBM50089941
Substrate/Competitorn/a
Meas. Tech.ChEMBL_1499429 (CHEMBL3583864)
IC50 370±n/a nM
Citation Labadie, SDragovich, PSChen, JFauber, BPBoggs, JCorson, LBDing, CZEigenbrot, CGe, HHo, QLai, KWMa, SMalek, SPeterson, DPurkey, HERobarge, KSalphati, LSideris, SUltsch, MVanderPorten, EWei, BXu, QYen, IYue, QZhang, HZhang, XZhou, A Optimization of 5-(2,6-dichlorophenyl)-3-hydroxy-2-mercaptocyclohex-2-enones as potent inhibitors of human lactate dehydrogenase. Bioorg Med Chem Lett25:75-82 (2015) 
 
L-lactate dehydrogenase A chain
Name:L-lactate dehydrogenase A chain
Type:Protein
Mol. Mass.:36694.85
Organism:Homo sapiens (Human)
Description:P00338::PDB Code: 4ajp
Residue:332
BDBM50089941
NameBDBM50089941
Synonyms:CHEMBL3581187
TypeSmall organic molecule
Emp. Form.C19H15Cl3O3S
Mol. Mass.429.745
SMILESCOc1ccc(Cl)c(SC2=C(O)CC(CC2=O)c2c(Cl)cccc2Cl)c1