Reaction Details
TargetCannabinoid receptor 2
LigandBDBM50089959
Substrate/Competitorn/a
Meas. Tech.ChEMBL_1499459 (CHEMBL3583992)
Ki 77±n/a nM
Citation Harnett, JJDolo, CViossat, IAuger, FFerrandis, EBigg, DAuguet, MAuvin, SChabrier, PE Novel azoles as potent and selective cannabinoid CB2 receptor agonists. Bioorg Med Chem Lett25:88-91 (2015) 
 
Cannabinoid receptor 2
Name:Cannabinoid receptor 2
Type:G Protein-Coupled Receptor (GPCR)
Mol. Mass.:39690.94
Organism:Homo sapiens (Human)
Description:P34972
Residue:360
BDBM50089959
NameBDBM50089959
Synonyms:CHEMBL3581225
TypeSmall organic molecule
Emp. Form.C26H40N2O2S
Mol. Mass.444.673
SMILESCCN(CC)C1(CCOCC1)c1nc(cs1)-c1cc(c(O)c(c1)C(C)(C)C)C(C)(C)C