Reaction Details
TargetCannabinoid receptor 2
LigandBDBM50089958
Substrate/Competitorn/a
Meas. Tech.ChEMBL_1499462 (CHEMBL3583995)
EC50 40±n/a nM
Citation Harnett, JJDolo, CViossat, IAuger, FFerrandis, EBigg, DAuguet, MAuvin, SChabrier, PE Novel azoles as potent and selective cannabinoid CB2 receptor agonists. Bioorg Med Chem Lett25:88-91 (2015) 
 
Cannabinoid receptor 2
Name:Cannabinoid receptor 2
Type:G Protein-Coupled Receptor (GPCR)
Mol. Mass.:39690.94
Organism:Homo sapiens (Human)
Description:P34972
Residue:360
BDBM50089958
NameBDBM50089958
Synonyms:CHEMBL3581226
TypeSmall organic molecule
Emp. Form.C27H40N2O2S
Mol. Mass.456.684
SMILESCC(C)(C)c1cc(cc(c1O)C(C)(C)C)-c1csc(n1)C1(CCOCC1)N1CCCCC1