Reaction Details
TargetMelanin-concentrating hormone receptor 1
LigandBDBM50094880
Substrate/Competitorn/a
Meas. Tech.ChEMBL_1502758 (CHEMBL3591009)
Ki 0.800000±n/a nM
Citation Devasthale, PWang, WHernandez, ASMoore, FRenduchintala, KSridhar, RPelleymounter, MALonghi, DHuang, NFlynn, NAzzara, AVRohrbach, KDevenny, JRooney, SThomas, MGlick, SGodonis, HHarvey, SCullen, MJZhang, HCaporuscio, CStetsko, PGrubb, MHuang, CZhang, LFreeden, CLi, YXMurphy, BJRobl, JAWashburn, WN Dihydropyrrolopyrazol-6-one MCHR1 antagonists for the treatment of obesity: Insights on in vivo efficacy from a novel FLIPR assay setup. Bioorg Med Chem Lett25:2793-9 (2015) 
 
Melanin-concentrating hormone receptor 1
Name:Melanin-concentrating hormone receptor 1
Type:Enzyme Catalytic Domain
Mol. Mass.:39075.64
Organism:RAT
Description:Melanin Concentrating Hormone 1 GPR24 RAT::P97639
Residue:353
BDBM50094880
NameBDBM50094880
Synonyms:CHEMBL3589145
TypeSmall organic molecule
Emp. Form.C21H21ClN6O
Mol. Mass.408.884
SMILESCN[C@H]1CCN(C1)c1ccc(cn1)N1Cc2cn(nc2C1=O)-c1ccc(Cl)cc1