Reaction Details
TargetUrokinase-type plasminogen activator
LigandBDBM50096792
Substrate/Competitorn/a
Meas. Tech.ChEMBL_1499040 (CHEMBL3584637)
Ki>1600±n/a nM
Citation Hu, ZWong, PCGilligan, PJHan, WPabbisetty, KBBozarth, JMCrain, EJHarper, TLuettgen, JMMyers, JERamamurthy, VRossi, KASheriff, SWatson, CAWei, AZheng, JJSeiffert, DAWexler, RRQuan, ML Discovery of a Potent Parenterally Administered Factor XIa Inhibitor with Hydroxyquinolin-2(1H)-one as the P2' Moiety. ACS Med Chem Lett6:590-5 (2015) 
 
Urokinase-type plasminogen activator
Name:Urokinase-type plasminogen activator
Type:Enzyme
Mol. Mass.:48528.62
Organism:Homo sapiens (Human)
Description:P00749
Residue:431
BDBM50096792
NameBDBM50096792
Synonyms:CHEMBL3580759
TypeSmall organic molecule
Emp. Form.C30H28Cl2N10O4
Mol. Mass.663.514
SMILESCN1CCN(CC1)C(=O)C[C@H](NC(=O)\C=C\c1cc(Cl)ccc1-n1cnnn1)c1nc(c(Cl)[nH]1)-c1ccc2[nH]c(=O)cc(O)c2c1