Reaction Details
TargetCoagulation factor VII
LigandBDBM50096792
Substrate/Competitorn/a
Meas. Tech.ChEMBL_1499030 (CHEMBL3584525)
Ki>13330±n/a nM
Citation Hu, ZWong, PCGilligan, PJHan, WPabbisetty, KBBozarth, JMCrain, EJHarper, TLuettgen, JMMyers, JERamamurthy, VRossi, KASheriff, SWatson, CAWei, AZheng, JJSeiffert, DAWexler, RRQuan, ML Discovery of a Potent Parenterally Administered Factor XIa Inhibitor with Hydroxyquinolin-2(1H)-one as the P2' Moiety. ACS Med Chem Lett6:590-5 (2015) 
 
Coagulation factor VII
Name:Coagulation factor VII
Type:Enzyme
Mol. Mass.:51599.89
Organism:Homo sapiens (Human)
Description:n/a
Residue:466
BDBM50096792
NameBDBM50096792
Synonyms:CHEMBL3580759
TypeSmall organic molecule
Emp. Form.C30H28Cl2N10O4
Mol. Mass.663.514
SMILESCN1CCN(CC1)C(=O)C[C@H](NC(=O)\C=C\c1cc(Cl)ccc1-n1cnnn1)c1nc(c(Cl)[nH]1)-c1ccc2[nH]c(=O)cc(O)c2c1