Reaction Details
TargetTyrosine-protein kinase Lck
LigandBDBM50097393
Substrate/Competitorn/a
Meas. Tech.ChEMBL_1501898 (CHEMBL3588238)
IC50 412±n/a nM
Citation Smith, CRDougan, DRKomandla, MKanouni, TKnight, BLawson, JDSabat, MTaylor, ERVu, PWyrick, C Fragment-Based Discovery of a Small Molecule Inhibitor of Bruton's Tyrosine Kinase. J Med Chem58:5437-44 (2015) 
 
Tyrosine-protein kinase Lck
Name:Tyrosine-protein kinase Lck
Type:n/a
Mol. Mass.:57987.83
Organism:Homo sapiens (Human)
Description:P06239
Residue:509
BDBM50097393
NameBDBM50097393
Synonyms:CHEMBL3586447
TypeSmall organic molecule
Emp. Form.C17H14N6O
Mol. Mass.318.3327
SMILESCc1cc2cn[nH]c2cc1-c1cccc2c(N)c(nnc12)C(N)=O