Reaction Details
TargetTyrosine-protein kinase Lck
LigandBDBM50097394
Substrate/Competitorn/a
Meas. Tech.ChEMBL_1501898 (CHEMBL3588238)
IC50 1300±n/a nM
Citation Smith, CRDougan, DRKomandla, MKanouni, TKnight, BLawson, JDSabat, MTaylor, ERVu, PWyrick, C Fragment-Based Discovery of a Small Molecule Inhibitor of Bruton's Tyrosine Kinase. J Med Chem58:5437-44 (2015) 
 
Tyrosine-protein kinase Lck
Name:Tyrosine-protein kinase Lck
Type:n/a
Mol. Mass.:57987.83
Organism:Homo sapiens (Human)
Description:P06239
Residue:509
BDBM50097394
NameBDBM50097394
Synonyms:CHEMBL3586446
TypeSmall organic molecule
Emp. Form.C16H12N6O
Mol. Mass.304.3061
SMILESNC(=O)c1nnc2c(cccc2c1N)-c1ccc2cn[nH]c2c1