Reaction Details
TargetTyrosine-protein kinase Lck
LigandBDBM50097398
Substrate/Competitorn/a
Meas. Tech.ChEMBL_1501898 (CHEMBL3588238)
IC50 38000±n/a nM
Citation Smith, CRDougan, DRKomandla, MKanouni, TKnight, BLawson, JDSabat, MTaylor, ERVu, PWyrick, C Fragment-Based Discovery of a Small Molecule Inhibitor of Bruton's Tyrosine Kinase. J Med Chem58:5437-44 (2015) 
 
Tyrosine-protein kinase Lck
Name:Tyrosine-protein kinase Lck
Type:n/a
Mol. Mass.:57987.83
Organism:Homo sapiens (Human)
Description:P06239
Residue:509
BDBM50097398
NameBDBM50097398
Synonyms:CHEMBL449216 | HTS-9026
TypeSmall organic molecule
Emp. Form.C9H8N4O
Mol. Mass.188.186
SMILESNC(=O)c1nnc2ccccc2c1N