Reaction Details
TargetBaculoviral IAP repeat-containing protein 2
LigandBDBM162123
Substrate/Competitorn/a
Meas. Tech.ChEMBL_1509648 (CHEMBL3603531)
IC50>50000±n/a nM
Citation Holzer, PMasuya, KFuret, PKallen, JValat-Stachyra, TFerretti, SBerghausen, JBouisset-Leonard, MBuschmann, NPissot-Soldermann, CRynn, CRuetz, SStutz, SChène, PJeay, SGessier, F Discovery of a Dihydroisoquinolinone Derivative (NVP-CGM097): A Highly Potent and Selective MDM2 Inhibitor Undergoing Phase 1 Clinical Trials in p53wt Tumors. J Med Chem58:6348-58 (2015) 
 
Baculoviral IAP repeat-containing protein 2
Name:Baculoviral IAP repeat-containing protein 2
Type:Protein
Mol. Mass.:69900.47
Organism:Homo sapiens (Human)
Description:Q13490
Residue:618
BDBM162123
NameBDBM162123
Synonyms:US9051279, 106
TypeSmall organic molecule
Emp. Form.C38H47ClN4O4
Mol. Mass.659.257
SMILESCOc1cc2CC(=O)N([C@@H](c3ccc(Cl)cc3)c2cc1OC(C)C)c1ccc(cc1)N(C)C[C@H]1CC[C@@H](CC1)N1CCN(C)C(=O)C1