Reaction Details
TargetCytochrome P450 3A4
LigandBDBM50111158
Substrate/Competitorn/a
Meas. Tech.ChEMBL_1509935 (CHEMBL3607753)
IC50 3981±n/a nM
Citation Becherer, JDBoros, EECarpenter, TYCowan, DJDeaton, DNHaffner, CDJeune, MRKaldor, IWPoole, JCPreugschat, FRheault, TRSchulte, CAShearer, BGShearer, TWShewchuk, LMSmalley, TLStewart, ELStuart, JDUlrich, JC Discovery of 4-Amino-8-quinoline Carboxamides as Novel, Submicromolar Inhibitors of NAD-Hydrolyzing Enzyme CD38. J Med Chem58:7021-56 (2015) 
 
Cytochrome P450 3A4
Name:Cytochrome P450 3A4
Type:Enzyme
Mol. Mass.:57349.57
Organism:Homo sapiens (Human)
Description:n/a
Residue:503
BDBM50111158
NameBDBM50111158
Synonyms:CHEMBL3604739
TypeSmall organic molecule
Emp. Form.C18H14Cl2FN3O
Mol. Mass.378.228
SMILESCc1cc(NCc2c(F)ccc(Cl)c2Cl)c2cccc(C(N)=O)c2n1