Reaction Details
TargetNuclear receptor ROR-gamma
LigandBDBM50044255
Substrate/Competitorn/a
Meas. Tech.ChEMBL_1513553 (CHEMBL3610010)
IC50 3.2±n/a nM
Citation Wang, YCai, WCheng, YYang, TLiu, QZhang, GMeng, QHan, FHuang, YZhou, LXiang, ZZhao, YGXu, YCheng, ZLu, SWu, QXiang, JNElliott, JDLeung, SRen, FLin, X Discovery of Biaryl Amides as Potent, Orally Bioavailable, and CNS Penetrant ROR¿t Inhibitors. ACS Med Chem Lett6:787-92 (2015) 
 
Nuclear receptor ROR-gamma
Name:Nuclear receptor ROR-gamma
Type:Enzyme Catalytic Domain
Mol. Mass.:58218.40
Organism:Homo sapiens (Human)
Description:P51449
Residue:518
BDBM50044255
NameBDBM50044255
Synonyms:CHEMBL3314016
TypeSmall organic molecule
Emp. Form.C23H19ClF3NO4S
Mol. Mass.497.914
SMILESCCS(=O)(=O)c1ccc(CC(=O)Nc2ccc(c(Cl)c2)-c2ccccc2OC(F)(F)F)cc1