Reaction Details
TargetPotassium voltage-gated channel subfamily H member 2
LigandBDBM50114810
Substrate/Competitorn/a
Meas. Tech.ChEMBL_1512331 (CHEMBL3611882)
Ki 8300±n/a nM
Citation Methot, JLFischer, CLi, CRivkin, AAhearn, SPBrown, WCKattar, SKelley, EMampreian, DMSchell, ARosenau, AZhou, HBall, RDeshmukh, SVJeliazkova-Mecheva, VVDiaz, DMoy, LYKenific, CMMoxham, CShah, SNuthall, HSzewczak, AAHill, AHughes, BSmotrov, NMunoz, BMiller, TAShearman, MS Potent benzoazepinoneż-secretase modulators with improved bioavailability. Bioorg Med Chem Lett25:3495-500 (2015) 
 
Potassium voltage-gated channel subfamily H member 2
Name:Potassium voltage-gated channel subfamily H member 2
Type:Multi-pass membrane protein
Mol. Mass.:126672.65
Organism:Homo sapiens (Human)
Description:Q12809
Residue:1159
BDBM50114810
NameBDBM50114810
Synonyms:CHEMBL3609754
TypeSmall organic molecule
Emp. Form.C24H19F5N6O
Mol. Mass.502.4393
SMILESCc1cn(cn1)-c1ccc(-c2cn(nn2)[C@H]2CCc3c(F)cccc3N(CC(F)(F)F)C2=O)c(F)c1