Reaction Details
TargetDiacylglycerol O-acyltransferase 2
LigandBDBM50117659
Substrate/Competitorn/a
Meas. Tech.ChEMBL_1515031 (CHEMBL3616243)
IC50>40000±n/a nM
Citation Huard, KLondregan, ATTesz, GBahnck, KBMagee, TVHepworth, DPolivkova, JCoffey, SBPabst, BAGosset, JRNigam, AKou, KSun, HLee, KHerr, MBoehm, MCarpino, PAGoodwin, BPerreault, CLi, QJorgensen, CCTkalcevic, GTSubashi, TAAhn, K Discovery of Selective Small Molecule Inhibitors of Monoacylglycerol Acyltransferase 3. J Med Chem58:7164-72 (2015) 
 
Diacylglycerol O-acyltransferase 2
Name:Diacylglycerol O-acyltransferase 2
Type:Multi-pass membrane protein
Mol. Mass.:43848.90
Organism:Homo sapiens (Human)
Description:Q96PD7
Residue:388
BDBM50117659
NameBDBM50117659
Synonyms:CHEMBL3613703
TypeSmall organic molecule
Emp. Form.C25H25FN2O4S
Mol. Mass.468.54
SMILESCOc1cccc(CC(=O)N2Cc3ccc(cc3C2)S(=O)(=O)NCCc2cccc(F)c2)c1