Reaction Details
TargetAlpha-1,6-mannosyl-glycoprotein 2-beta-N-acetylglucosaminyltransferase
LigandBDBM50117659
Substrate/Competitorn/a
Meas. Tech.ChEMBL_1515029 (CHEMBL3616241)
IC50 31623±n/a nM
Citation Huard, KLondregan, ATTesz, GBahnck, KBMagee, TVHepworth, DPolivkova, JCoffey, SBPabst, BAGosset, JRNigam, AKou, KSun, HLee, KHerr, MBoehm, MCarpino, PAGoodwin, BPerreault, CLi, QJorgensen, CCTkalcevic, GTSubashi, TAAhn, K Discovery of Selective Small Molecule Inhibitors of Monoacylglycerol Acyltransferase 3. J Med Chem58:7164-72 (2015) 
 
Alpha-1,6-mannosyl-glycoprotein 2-beta-N-acetylglucosaminyltransferase
Name:Alpha-1,6-mannosyl-glycoprotein 2-beta-N-acetylglucosaminyltransferase
Type:n/a
Mol. Mass.:51567.80
Organism:Homo sapiens (Human)
Description:Q10469
Residue:447
BDBM50117659
NameBDBM50117659
Synonyms:CHEMBL3613703
TypeSmall organic molecule
Emp. Form.C25H25FN2O4S
Mol. Mass.468.54
SMILESCOc1cccc(CC(=O)N2Cc3ccc(cc3C2)S(=O)(=O)NCCc2cccc(F)c2)c1