Reaction Details
TargetAlpha-1,6-mannosyl-glycoprotein 2-beta-N-acetylglucosaminyltransferase
LigandBDBM50117665
Substrate/Competitorn/a
Meas. Tech.ChEMBL_1515029 (CHEMBL3616241)
IC50 19953±n/a nM
Citation Huard, KLondregan, ATTesz, GBahnck, KBMagee, TVHepworth, DPolivkova, JCoffey, SBPabst, BAGosset, JRNigam, AKou, KSun, HLee, KHerr, MBoehm, MCarpino, PAGoodwin, BPerreault, CLi, QJorgensen, CCTkalcevic, GTSubashi, TAAhn, K Discovery of Selective Small Molecule Inhibitors of Monoacylglycerol Acyltransferase 3. J Med Chem58:7164-72 (2015) 
 
Alpha-1,6-mannosyl-glycoprotein 2-beta-N-acetylglucosaminyltransferase
Name:Alpha-1,6-mannosyl-glycoprotein 2-beta-N-acetylglucosaminyltransferase
Type:n/a
Mol. Mass.:51567.80
Organism:Homo sapiens (Human)
Description:Q10469
Residue:447
BDBM50117665
NameBDBM50117665
Synonyms:CHEMBL3613709
TypeSmall organic molecule
Emp. Form.C23H25N5O4S
Mol. Mass.467.541
SMILESCOc1cccc(CC(=O)N2Cc3ccc(cc3C2)S(=O)(=O)Nc2cnn(n2)C2CCC2)c1