Reaction Details
TargetMuscarinic acetylcholine receptor M1
LigandBDBM50119627
Substrate/Competitorn/a
Meas. Tech.ChEMBL_1517982 (CHEMBL3618687)
EC50 198±n/a nM
Citation Liu, BCroy, CHHitchcock, SAAllen, JRRao, ZEvans, DBures, MGMcKinzie, DLWatt, MLStuart Gregory, GHansen, MMHoogestraat, PJJamison, JAOkha-Mokube, FMStratford, RETurner, WBymaster, FFelder, CC Design and synthesis of N-[6-(Substituted Aminoethylideneamino)-2-Hydroxyindan-1-yl]arylamides as selective and potent muscarinic M1 agonists. Bioorg Med Chem Lett25:4158-63 (2015) 
 
Muscarinic acetylcholine receptor M1
Name:Muscarinic acetylcholine receptor M1
Type:Protein
Mol. Mass.:51442.54
Organism:Homo sapiens (Human)
Description:P11229
Residue:460
BDBM50119627
NameBDBM50119627
Synonyms:CHEMBL3618441
TypeSmall organic molecule
Emp. Form.C26H26BrN3O3
Mol. Mass.508.407
SMILESCOc1cccc(CN\C(C)=N\c2ccc3C[C@@H](O)[C@H](NC(=O)c4ccc(Br)cc4)c3c2)c1