Reaction Details
TargetMuscarinic acetylcholine receptor M1
LigandBDBM50119645
Substrate/Competitorn/a
Meas. Tech.ChEMBL_1517982 (CHEMBL3618687)
EC50 36±n/a nM
Citation Liu, BCroy, CHHitchcock, SAAllen, JRRao, ZEvans, DBures, MGMcKinzie, DLWatt, MLStuart Gregory, GHansen, MMHoogestraat, PJJamison, JAOkha-Mokube, FMStratford, RETurner, WBymaster, FFelder, CC Design and synthesis of N-[6-(Substituted Aminoethylideneamino)-2-Hydroxyindan-1-yl]arylamides as selective and potent muscarinic M1 agonists. Bioorg Med Chem Lett25:4158-63 (2015) 
 
Muscarinic acetylcholine receptor M1
Name:Muscarinic acetylcholine receptor M1
Type:Protein
Mol. Mass.:51442.54
Organism:Homo sapiens (Human)
Description:P11229
Residue:460
BDBM50119645
NameBDBM50119645
Synonyms:CHEMBL3616500
TypeSmall organic molecule
Emp. Form.C27H25F4N3O2
Mol. Mass.499.4999
SMILESCN(Cc1ccc(F)cc1)C(\C)=N\c1ccc2C[C@@H](O)[C@H](NC(=O)c3ccc(cc3)C(F)(F)F)c2c1