Reaction Details
TargetMuscarinic acetylcholine receptor M4
LigandBDBM50119641
Substrate/Competitorn/a
Meas. Tech.ChEMBL_1517988 (CHEMBL3618845)
EC50 405±n/a nM
Citation Liu, BCroy, CHHitchcock, SAAllen, JRRao, ZEvans, DBures, MGMcKinzie, DLWatt, MLStuart Gregory, GHansen, MMHoogestraat, PJJamison, JAOkha-Mokube, FMStratford, RETurner, WBymaster, FFelder, CC Design and synthesis of N-[6-(Substituted Aminoethylideneamino)-2-Hydroxyindan-1-yl]arylamides as selective and potent muscarinic M1 agonists. Bioorg Med Chem Lett25:4158-63 (2015) 
 
Muscarinic acetylcholine receptor M4
Name:Muscarinic acetylcholine receptor M4
Type:Enzyme Catalytic Domain
Mol. Mass.:53079.31
Organism:Homo sapiens (Human)
Description:Cholinergic, muscarinic M4 CHRM4 HUMAN M3::P08173
Residue:479
BDBM50119641
NameBDBM50119641
Synonyms:CHEMBL3618450
TypeSmall organic molecule
Emp. Form.C26H25ClFN3O2
Mol. Mass.465.947
SMILESCN(Cc1ccc(F)cc1)C(\C)=N\c1ccc2C[C@@H](O)[C@H](NC(=O)c3ccc(Cl)cc3)c2c1