Reaction Details
TargetCytochrome P450 26A1
LigandBDBM50120455
Substrate/Competitorn/a
Meas. Tech.ChEMBL_1517856 (CHEMBL3620652)
IC50 10.0±n/a nM
Citation Sun, BLiu, KHan, JZhao, LYSu, XLin, BZhao, DMCheng, MS Design, synthesis, and biological evaluation of amide imidazole derivatives as novel metabolic enzyme CYP26A1 inhibitors. Bioorg Med Chem23:6763-73 (2015) 
 
Cytochrome P450 26A1
Name:Cytochrome P450 26A1
Type:Enzyme
Mol. Mass.:56216.16
Organism:Homo sapiens (Human)
Description:O43174
Residue:497
BDBM50120455
NameBDBM50120455
Synonyms:CHEMBL3617993
TypeSmall organic molecule
Emp. Form.C20H22N6S
Mol. Mass.378.494
SMILESCC(C(c1ccc(Nc2nc3ccccc3s2)cc1)n1cncn1)N(C)C