Reaction Details
TargetcAMP and cAMP-inhibited cGMP 3',5'-cyclic phosphodiesterase 10A
LigandBDBM135588
Substrate/Competitorn/a
Meas. Tech.ChEMBL_1523240 (CHEMBL3632375)
Ki 6.1±n/a nM
Citation Cox, CDHostetler, EDFlores, BAEvelhoch, JLFan, HGantert, LHolahan, MEng, WJoshi, AMcGaughey, GMeng, XPurcell, MRaheem, ITRiffel, KYan, YRenger, JJSmith, SMColeman, PJ Discovery of [ııC]MK-8193 as a PET tracer to measure target engagement of phosphodiesterase 10A (PDE10A) inhibitors. Bioorg Med Chem Lett25:4893-8 (2015) 
 
cAMP and cAMP-inhibited cGMP 3',5'-cyclic phosphodiesterase 10A
Name:cAMP and cAMP-inhibited cGMP 3',5'-cyclic phosphodiesterase 10A
Type:Protein
Mol. Mass.:88412.52
Organism:Homo sapiens (Human)
Description:Q9Y233
Residue:1055
BDBM135588
NameBDBM135588
Synonyms:US8846000, 1-4
TypeSmall organic molecule
Emp. Form.C26H21N3O4
Mol. Mass.439.4626
SMILESCOc1ccc(cc1)-n1c(CCN2C(=O)c3cccc(C)c3C2=O)nc2ccccc2c1=O