Reaction Details
TargetcAMP and cAMP-inhibited cGMP 3',5'-cyclic phosphodiesterase 10A
LigandBDBM50126108
Substrate/Competitorn/a
Meas. Tech.ChEMBL_1523240 (CHEMBL3632375)
Ki 1.000000±n/a nM
Citation Cox, CDHostetler, EDFlores, BAEvelhoch, JLFan, HGantert, LHolahan, MEng, WJoshi, AMcGaughey, GMeng, XPurcell, MRaheem, ITRiffel, KYan, YRenger, JJSmith, SMColeman, PJ Discovery of [ııC]MK-8193 as a PET tracer to measure target engagement of phosphodiesterase 10A (PDE10A) inhibitors. Bioorg Med Chem Lett25:4893-8 (2015) 
 
cAMP and cAMP-inhibited cGMP 3',5'-cyclic phosphodiesterase 10A
Name:cAMP and cAMP-inhibited cGMP 3',5'-cyclic phosphodiesterase 10A
Type:Protein
Mol. Mass.:88412.52
Organism:Homo sapiens (Human)
Description:Q9Y233
Residue:1055
BDBM50126108
NameBDBM50126108
Synonyms:CHEMBL3627840
TypeSmall organic molecule
Emp. Form.C27H23N3O5
Mol. Mass.469.4886
SMILESCCOc1cccc2C(=O)N(CCc3nc4ccccc4c(=O)n3-c3ccc(OC)cc3)C(=O)c12