Reaction Details
TargetEpidermal growth factor receptor
LigandBDBM50126846
Substrate/Competitorn/a
Meas. Tech.ChEMBL_1523969 (CHEMBL3630441)
IC50 4720±n/a nM
Citation Salerno, SMarini, AMFornaciari, GSimorini, FLa Motta, CTaliani, SSartini, SDa Settimo, FGarcía-Argáez, ANGia, OCosconati, SNovellino, ED'Ocon, PFioravanti, AOrlandi, PBocci, GDalla Via, L Investigation of new 2-aryl substituted Benzothiopyrano[4,3-d]pyrimidines as kinase inhibitors targeting vascular endothelial growth factor receptor 2. Eur J Med Chem103:29-43 (2015) 
 
Epidermal growth factor receptor
Name:Epidermal growth factor receptor
Type:Receptor Kinase Domain
Mol. Mass.:134279.59
Organism:Homo sapiens (Human)
Description:P00533
Residue:1210
BDBM50126846
NameBDBM50126846
Synonyms:CHEMBL481789
TypeSmall organic molecule
Emp. Form.C18H14N2OS
Mol. Mass.306.382
SMILESCOc1ccc-2c(SCc3cnc(nc-23)-c2ccccc2)c1