Reaction Details
TargetEpidermal growth factor receptor
LigandBDBM50126850
Substrate/Competitorn/a
Meas. Tech.ChEMBL_1523969 (CHEMBL3630441)
IC50 45700±n/a nM
Citation Salerno, SMarini, AMFornaciari, GSimorini, FLa Motta, CTaliani, SSartini, SDa Settimo, FGarcía-Argáez, ANGia, OCosconati, SNovellino, ED'Ocon, PFioravanti, AOrlandi, PBocci, GDalla Via, L Investigation of new 2-aryl substituted Benzothiopyrano[4,3-d]pyrimidines as kinase inhibitors targeting vascular endothelial growth factor receptor 2. Eur J Med Chem103:29-43 (2015) 
 
Epidermal growth factor receptor
Name:Epidermal growth factor receptor
Type:Receptor Kinase Domain
Mol. Mass.:134279.59
Organism:Homo sapiens (Human)
Description:P00533
Residue:1210
BDBM50126850
NameBDBM50126850
Synonyms:CHEMBL3628818
TypeSmall organic molecule
Emp. Form.C17H11Cl2N3S
Mol. Mass.360.26
SMILESClc1ccc(Nc2ncc3CSc4cc(Cl)ccc4-c3n2)cc1