Reaction Details
TargetRho-associated protein kinase 2
LigandBDBM50130039
Substrate/Competitorn/a
Meas. Tech.ChEMBL_1524294 (CHEMBL3631887)
IC50>20000±n/a nM
Citation Cui, JDing, MDeng, WYin, YWang, ZZhou, HSun, GJiang, YFeng, Y Discovery of bis-aryl urea derivatives as potent and selective Limk inhibitors: Exploring Limk1 activity and Limk1/ROCK2 selectivity through a combined computational study. Bioorg Med Chem23:7464-77 (2015) 
 
Rho-associated protein kinase 2
Name:Rho-associated protein kinase 2
Type:Protein
Mol. Mass.:160885.43
Organism:Homo sapiens (Human)
Description:O75116
Residue:1388
BDBM50130039
NameBDBM50130039
Synonyms:CHEMBL3629276
TypeSmall organic molecule
Emp. Form.C21H18FN5O2
Mol. Mass.391.3983
SMILESCOc1ccc(NC(=O)Nc2ccc(cc2F)-c2ncnc3[nH]cc(C)c23)cc1