Reaction Details
TargetLIM domain kinase 1
LigandBDBM50130038
Substrate/Competitorn/a
Meas. Tech.ChEMBL_1524293 (CHEMBL3631886)
IC50 11±n/a nM
Citation Cui, JDing, MDeng, WYin, YWang, ZZhou, HSun, GJiang, YFeng, Y Discovery of bis-aryl urea derivatives as potent and selective Limk inhibitors: Exploring Limk1 activity and Limk1/ROCK2 selectivity through a combined computational study. Bioorg Med Chem23:7464-77 (2015) 
 
LIM domain kinase 1
Name:LIM domain kinase 1
Type:Enzyme Catalytic Domain
Mol. Mass.:72591.81
Organism:Homo sapiens (Human)
Description:gi_4505001
Residue:647
BDBM50130038
NameBDBM50130038
Synonyms:CHEMBL3629277
TypeSmall organic molecule
Emp. Form.C20H17FN6O
Mol. Mass.376.387
SMILESCc1c[nH]c2ncnc(-c3ccc(NC(=O)Nc4ccc(C)nc4)c(F)c3)c12