Reaction Details
TargetcAMP and cAMP-inhibited cGMP 3',5'-cyclic phosphodiesterase 10A
LigandBDBM50130763
Substrate/Competitorn/a
Meas. Tech.ChEMBL_1525203 (CHEMBL3635514)
IC50 0.730000±n/a nM
Citation Lingam, VSDahale, DHRathi, VEShingote, YBThakur, RRMindhe, ASKummari, SKhairatkar-Joshi, NBajpai, MShah, DMSapalya, RSGullapalli, SGupta, PKGudi, GSJadhav, SBPattem, RThomas, A Design, Synthesis, and Pharmacological Evaluation of 5,6-Disubstituted Pyridin-2(1H)-one Derivatives as Phosphodiesterase 10A (PDE10A) Antagonists. J Med Chem58:8292-308 (2015) 
 
cAMP and cAMP-inhibited cGMP 3',5'-cyclic phosphodiesterase 10A
Name:cAMP and cAMP-inhibited cGMP 3',5'-cyclic phosphodiesterase 10A
Type:Protein
Mol. Mass.:88412.52
Organism:Homo sapiens (Human)
Description:Q9Y233
Residue:1055
BDBM50130763
NameBDBM50130763
Synonyms:CHEMBL3634858
TypeSmall organic molecule
Emp. Form.C26H20ClN3O2
Mol. Mass.441.909
SMILESCn1ccc2nc(COc3ccc(cc3)-c3ccc(=O)[nH]c3-c3ccc(Cl)cc3)ccc12