Reaction Details
TargetcAMP and cAMP-inhibited cGMP 3',5'-cyclic phosphodiesterase 10A
LigandBDBM50130856
Substrate/Competitorn/a
Meas. Tech.ChEMBL_1525203 (CHEMBL3635514)
IC50 1.9±n/a nM
Citation Lingam, VSDahale, DHRathi, VEShingote, YBThakur, RRMindhe, ASKummari, SKhairatkar-Joshi, NBajpai, MShah, DMSapalya, RSGullapalli, SGupta, PKGudi, GSJadhav, SBPattem, RThomas, A Design, Synthesis, and Pharmacological Evaluation of 5,6-Disubstituted Pyridin-2(1H)-one Derivatives as Phosphodiesterase 10A (PDE10A) Antagonists. J Med Chem58:8292-308 (2015) 
 
cAMP and cAMP-inhibited cGMP 3',5'-cyclic phosphodiesterase 10A
Name:cAMP and cAMP-inhibited cGMP 3',5'-cyclic phosphodiesterase 10A
Type:Protein
Mol. Mass.:88412.52
Organism:Homo sapiens (Human)
Description:Q9Y233
Residue:1055
BDBM50130856
NameBDBM50130856
Synonyms:CHEMBL3634751
TypeSmall organic molecule
Emp. Form.C28H22N2O2
Mol. Mass.418.4865
SMILESCc1ccc(cc1)-c1[nH]c(=O)ccc1-c1ccc(OCc2ccc3ccccc3n2)cc1