Reaction Details
TargetAcetylcholinesterase
LigandBDBM50073113
Substrate/Competitorn/a
Meas. Tech.ChEMBL_1525953 (CHEMBL3635777)
IC50 690±n/a nM
Citation Nepovimova, EKorabecny, JDolezal, RBabkova, KOndrejicek, AJun, DSepsova, VHorova, AHrabinova, MSoukup, OBukum, NJost, PMuckova, LKassa, JMalinak, DAndrs, MKuca, K Tacrine-Trolox Hybrids: A Novel Class of Centrally Active, Nonhepatotoxic Multi-Target-Directed Ligands Exerting Anticholinesterase and Antioxidant Activities with Low In Vivo Toxicity. J Med Chem58:8985-9003 (2015) 
 
Acetylcholinesterase
Name:Acetylcholinesterase
Type:Enzyme
Mol. Mass.:67792.70
Organism:Homo sapiens (Human)
Description:P22303
Residue:614
BDBM50073113
NameBDBM50073113
Synonyms:CHEMBL3410955
TypeSmall organic molecule
Emp. Form.C34H45N3O3
Mol. Mass.543.7394
SMILESCc1c(C)c2OC(C)(CCc2c(C)c1O)C(=O)NCCCCCCCNc1c2CCCCc2nc2ccccc12