Reaction Details
TargetAcetylcholinesterase
LigandBDBM50133449
Substrate/Competitorn/a
Meas. Tech.ChEMBL_1525953 (CHEMBL3635777)
IC50 210±n/a nM
Citation Nepovimova, EKorabecny, JDolezal, RBabkova, KOndrejicek, AJun, DSepsova, VHorova, AHrabinova, MSoukup, OBukum, NJost, PMuckova, LKassa, JMalinak, DAndrs, MKuca, K Tacrine-Trolox Hybrids: A Novel Class of Centrally Active, Nonhepatotoxic Multi-Target-Directed Ligands Exerting Anticholinesterase and Antioxidant Activities with Low In Vivo Toxicity. J Med Chem58:8985-9003 (2015) 
 
Acetylcholinesterase
Name:Acetylcholinesterase
Type:Enzyme
Mol. Mass.:67792.70
Organism:Homo sapiens (Human)
Description:P22303
Residue:614
BDBM50133449
NameBDBM50133449
Synonyms:CHEMBL3632988
TypeSmall organic molecule
Emp. Form.C29H34ClN3O3
Mol. Mass.508.052
SMILESCc1c(C)c2OC(C)(CCc2c(C)c1O)C(=O)NCCNc1c2CCCCc2nc2cc(Cl)ccc12