Reaction Details
TargetAcetylcholinesterase
LigandBDBM8987
Substrate/Competitorn/a
Meas. Tech.ChEMBL_1525953 (CHEMBL3635777)
IC50 20±n/a nM
Citation Nepovimova, EKorabecny, JDolezal, RBabkova, KOndrejicek, AJun, DSepsova, VHorova, AHrabinova, MSoukup, OBukum, NJost, PMuckova, LKassa, JMalinak, DAndrs, MKuca, K Tacrine-Trolox Hybrids: A Novel Class of Centrally Active, Nonhepatotoxic Multi-Target-Directed Ligands Exerting Anticholinesterase and Antioxidant Activities with Low In Vivo Toxicity. J Med Chem58:8985-9003 (2015) 
 
Acetylcholinesterase
Name:Acetylcholinesterase
Type:Enzyme
Mol. Mass.:67792.70
Organism:Homo sapiens (Human)
Description:P22303
Residue:614
BDBM8987
NameBDBM8987
Synonyms:6-chloro-1,2,3,4-tetrahydroacridin-9-amine 6-chlorotacrine.HCl Tacrine Analogue 4
TypeSmall organic molecule
Emp. Form.C13H13ClN2
Mol. Mass.232.709
SMILESNc1c2CCCCc2nc2cc(Cl)ccc12