Reaction Details
TargetCytochrome P450 2D6
LigandBDBM50133595
Substrate/Competitorn/a
Meas. Tech.ChEMBL_1526173 (CHEMBL3636698)
IC50>100000±n/a nM
Citation Ruggeri, RBBuckbinder, LBagley, SWCarpino, PAConn, ELDowling, MSFernando, DPJiao, WKung, DWOrr, STQi, YRocke, BNSmith, AWarmus, JSZhang, YBowles, DWidlicka, DWEng, HRyder, TSharma, RWolford, AOkerberg, CWalters, KMaurer, TSZhang, YBonin, PDSpath, SNXing, GHepworth, DAhn, KKalgutkar, AS Discovery of 2-(6-(5-Chloro-2-methoxyphenyl)-4-oxo-2-thioxo-3,4-dihydropyrimidin-1(2H)-yl)acetamide (PF-06282999): A Highly Selective Mechanism-Based Myeloperoxidase Inhibitor for the Treatment of Cardiovascular Diseases. J Med Chem58:8513-28 (2015) 
 
Cytochrome P450 2D6
Name:Cytochrome P450 2D6
Type:Protein
Mol. Mass.:55774.82
Organism:Homo sapiens (Human)
Description:P10635
Residue:497
BDBM50133595
NameBDBM50133595
Synonyms:CHEMBL3633460
TypeSmall organic molecule
Emp. Form.C13H12ClN3O3S
Mol. Mass.325.771
SMILESCOc1ccc(Cl)cc1-c1cc(=O)[nH]c(=S)n1CC(N)=O