Reaction Details
TargetMyeloperoxidase
LigandBDBM50133602
Substrate/Competitorn/a
Meas. Tech.ChEMBL_1526125 (CHEMBL3636509)
Ki 174±n/a nM
Citation Ruggeri, RBBuckbinder, LBagley, SWCarpino, PAConn, ELDowling, MSFernando, DPJiao, WKung, DWOrr, STQi, YRocke, BNSmith, AWarmus, JSZhang, YBowles, DWidlicka, DWEng, HRyder, TSharma, RWolford, AOkerberg, CWalters, KMaurer, TSZhang, YBonin, PDSpath, SNXing, GHepworth, DAhn, KKalgutkar, AS Discovery of 2-(6-(5-Chloro-2-methoxyphenyl)-4-oxo-2-thioxo-3,4-dihydropyrimidin-1(2H)-yl)acetamide (PF-06282999): A Highly Selective Mechanism-Based Myeloperoxidase Inhibitor for the Treatment of Cardiovascular Diseases. J Med Chem58:8513-28 (2015) 
 
Myeloperoxidase
Name:Myeloperoxidase
Type:Enzyme
Mol. Mass.:83888.32
Organism:Homo sapiens (Human)
Description:P05164
Residue:745
BDBM50133602
NameBDBM50133602
Synonyms:CHEMBL3633250
TypeSmall organic molecule
Emp. Form.C14H17N3O3S
Mol. Mass.307.368
SMILESCOc1ccc(c(OC)c1)-c1cc(=O)[nH]c(=S)n1CCN