Reaction Details
TargetTyrosine-protein kinase Fgr
LigandBDBM50134320
Substrate/Competitorn/a
Meas. Tech.ChEMBL_1544630 (CHEMBL3750474)
IC50 1033±n/a nM
Citation Young, WBBarbosa, JBlomgren, PBremer, MCCrawford, JJDambach, DEigenbrot, CGallion, SJohnson, ARKropf, JELee, SHLiu, LLubach, JWMacaluso, JMaciejewski, PMitchell, SAOrtwine, DFDi Paolo, JReif, KScheerens, HSchmitt, AWang, XWong, HXiong, JMXu, JYu, CZhao, ZCurrie, KS Discovery of highly potent and selective Bruton's tyrosine kinase inhibitors: Pyridazinone analogs with improved metabolic stability. Bioorg Med Chem Lett26:575-9 (2016) 
 
Tyrosine-protein kinase Fgr
Name:Tyrosine-protein kinase Fgr
Type:protein
Mol. Mass.:59469.88
Organism:Homo sapiens (Human)
Description:P09769
Residue:529
BDBM50134320
NameBDBM50134320
Synonyms:CHEMBL3746293
TypeSmall organic molecule
Emp. Form.C27H24FN7O2S
Mol. Mass.529.589
SMILESCN1CCn2nc(Nc3cc(n[nH]c3=O)-c3ccc(F)c(NC(=O)c4cc5ccccc5s4)c3C)cc2C1